{"text_format":"3","workbook":"xlsx","n_sheets":4,"sheets":["劳务","劳务清单表、分析表","机械清单表","材料清单表"],"not_rendered":{"images":3,"defined_names":8},"read":"whole","date_system":"1900"}

{"sheet":"劳务","index":0,"n_rows":14,"n_cols":7,"rows_kept":14,"merged":[[0,0,0,6],[1,0,1,6]]}
["控制价清单表"]
["隆昌市城市建筑弃土堆放场临时用地土地复垦项目—劳务分包采购控制价清单"]
["序号","工程或费用名称","工作内容","单位","工程数量（暂估）","含税控制单价（3%）","含税控制合价（3%）"]
[1,"土壤剥覆工程及平整工程","[项目特征]\n1.土石类别:不区分土石成分，综合考虑\n2.判断标准:人工开挖槽凡图示槽底宽（不含加宽工作面）在5m以内，且槽底长大于底宽三倍以上者，执行本清单项；机械开挖槽凡图示槽底宽（不含加宽工作面）在7m以内，且槽底长大于底宽三倍以上者，执行本清单项；除上述规定外执行平基项目。\n3.开挖深度:根据原始地形图、平基施工图、地质勘察报告、基础设计施工图等综合考虑\n4.开挖方式:机械开挖，人工捡底\n6.弃渣运距:综合考虑\n[工程内容]\n1.表土回覆、客土回填、边坡放坡\n2.表土回填，耕作层≥30cm，耕作层应采用优质表土进行覆盖。旱地覆土50cm（耕作层不少于30cm），林地覆土30cm。\n3.处理渗水、积水\n4.清理\n5.场内运输\n6.安全防护、警卫\n7.平整、夯实；修整底、边","m3",{"v":26532,"d":"26532.00"},4.07,{"$f":"ROUND(E4*F4,2)","v":107985.24}]
[2,"清理工程","[项目特征]\n混凝土拆除\n[工程内容]\n拆除和清理项目区内板房和洗车池的硬化地面\n","m3",{"v":72.3,"d":"72.30"},15.45,1117.04]
[3,"地力培肥（耕地）","[项目特征]\n耕地施肥绿肥22500kg/公顷、农家肥9000kg/公顷、复合肥1500kg/公顷（N.P.V有效含量≥40%）\n[工程内容]\n1.配合机械地力培肥；\n2.分配平衡施肥比例；\n3.实施年限：3年","hm2",{"v":11.0382,"d":"11.04"},{"v":1390.5,"d":"1390.50"},15348.62]
[4,"地力培肥（林地）","[项目特征]\n林地施肥绿肥15000kg/公顷，商品有机肥3000kg/公顷(有机质含量≥65%)）\n[工程内容]\n1.配合机械地力培肥；\n2.分配平衡施肥比例；\n3.实施年限：3年","hm2",{"v":8.1264,"d":"8.13"},{"v":1390.5,"d":"1390.50"},11299.76]
[5,"新建灌排渠","[项目特征]\n1.沟渠开挖\n2.M7.5浆砌砖排水沟，排水沟（0.4×0.4m）\n3.C20砼底板\n4.M10砂浆抹面\n[工程内容]\n1.混凝土制作、运输、浇筑、振捣、养护、打磨平整、切缝、刻痕\n2.表面凿毛或收光\n3.商品砼采用甲供，其余材料及机械均由分包人提供\n4.M7.5砌筑工作；\n5.材料搬运、拌、运砂浆；\n6.搭、拆脚手架；\n7.砌筑、勾缝、养护；\n8.沉降缝胶泥制作与填抹；\n9.排水孔下的胶泥铺设与孔口填石；\n10.安全措施。","m",{"v":962,"d":"962.00"},79.88,76844.56]
[6,"新建生产路","[项目特征]\n1.土方开挖\n2.土方回填\n3.路床压实\n4.C20砼路面10CM、15CM\n5.泥结碎石路基\n[工程内容]\n1.模板制作、安装、拆除、平面定位、高程控制\n2.混凝浇筑、振捣、养护\n3.类型：混凝土路面\n4.拉毛、压痕或刻防滑槽\n5.伸缩缝\n6.锯缝、嵌缝\n7.路面养护\n8.现场安全防护及管理","m",{"v":549,"d":"549.00"},19.07,10469.43]
[7,"硬化背沟","[项目特征]\n1.沟渠开挖\n2.M7.5浆砌砖排水沟\n3.C20砼底板\n4.M10砂浆抹面\n[工程内容]\n1.混凝土制作、运输、浇筑、振捣、养护、打磨平整、切缝、刻痕\n2.表面凿毛或收光\n3.商品砼采用甲供，其余材料及机械均由分包人提供\n4.M7.5砌筑工作；\n5.材料搬运、拌、运砂浆；\n6.搭、拆脚手架；\n7.砌筑、勾缝、养护；\n8.沉降缝胶泥制作与填抹；\n9.排水孔下的胶泥铺设与孔口填石；\n10.安全措施。","m",{"v":2591,"d":"2591.00"},25.45,65940.95]
[8,"新建蓄水池","[项目特征]\n1.C20现浇砼\n2.M7.5浆砌砖\n3.M10砂浆抹面\n4.土方开挖\n5.土方回填\n6.钢筋\n7.基底碾压\n8.防渗土工膜\n9.C30现浇砼\n10.C20现浇砼路面\n11.新建蓄水池采用圆形池体，水池内半径3.3m，水池深3.4m\n[工程内容]\n1.开挖、回填、砌筑、模板制作、安装、拆除\n2.混凝土运输、浇筑（砼浇注前、后的系列工作，包括砼施工的施工前准备，编制砼用量计划、清洁、修复、浇注、泵送配合、根据进度留设施工缝、施工缝处理剔打、养护、砼等垃圾处理、砼浇注质量问题处理等除砼搅拌外的砼施工的全部工序内容）\n3.安全设施搭拆、个人安全措施、自备辅材、自备所有施工机械设备及工器具                                       \n4.养护：\n","座",{"v":1,"d":"1.00"},12638.13,12638.13]
[9,"种植香樟树","[项目特征]\n种植香樟树\n[工程内容]\n采用株行距2.5×2.5米，约1600株/hm2，栽植要求穴规格为50×50×50cm的矩形坑；移植苗需要满足以下要求：米径2～3cm，高100～150cm，带土团20cm以上，无损伤。苗木栽植包括扶正、回土、提苗、捣实、筑水围，浇水，覆土保墒，回土要求回填细碎表土\n","株",{"v":4334,"d":"4334.00"},4.63,20066.42]
[10,"撒播草籽","[项目特征]\n撒播草籽狗牙根、百喜草、地锦撒播草种80kg/hm2\n[工程内容]\n1.边坡覆土；\n2.人工撒草籽、植草；\n3.初期养护;","公顷",{"v":2.7088,"d":"2.71"},{"v":1390.5,"d":"1390.50"},3766.59]
[null,"合计",{"$nulls":4},{"$f":"SUM(G4:G13)","v":325476.74}]

{"sheet":"劳务清单表、分析表","index":1,"n_rows":86,"n_cols":10,"rows_kept":86,"hidden":true,"merged":[[3,0,3,9],[4,0,4,9],[5,0,6,0],[5,1,6,1],[5,2,6,2],[5,3,6,3],[5,4,6,4],[5,5,6,5],[5,6,6,6],[5,7,5,8],[5,9,6,9],[83,1,83,4]]}
[]
[]
[]
["人工费用控制汇总表"]
["隆昌市城市建筑弃土堆放场临时用地土地复垦项目"]
["序号","工程或费用名称","工作内容","单位","工程数量","单价\n(不含税）","合价（元）","成本测算（含税）",null,"备注"]
[{"$nulls":7},"人工费单价（元）","人工费合价(元)"]
[1,"表土剥离","1.配合机械表土剥离\n2.测量放样、规划剥离区域\n3.人工配合转移机械\n4.现场安全防护及管理",{"$f":"VLOOKUP(B8,#REF!,2,FALSE)","v":{"$error":"#REF!"}},{"$f":"SUMIF(#REF!,B8,#REF!)","v":{"$error":"#REF!"}},{"$f":"VLOOKUP(B8,#REF!,6,FALSE)","v":{"$error":"#REF!"}},{"$f":"ROUND(E8*F8,2)","v":{"$error":"#REF!"}},{"$f":"ROUND(F8*1.03,2)","v":{"$error":"#REF!"}},{"$f":"ROUND(E8*H8,2)","v":{"$error":"#REF!"}}]
[2,"表土回填","1.配合机械整平土方\n2.测量放样\n3.表土回填、人工配合机械夯实\n4.现场安全防护及管理",{"$f":"VLOOKUP(B9,#REF!,2,FALSE)","v":{"$error":"#REF!"}},{"$f":"SUMIF(#REF!,B9,#REF!)","v":{"$error":"#REF!"}},{"$f":"VLOOKUP(B9,#REF!,6,FALSE)","v":{"$error":"#REF!"}},{"$error":"#REF!"},{"$error":"#REF!"},{"$error":"#REF!"}]
[3,"土地翻耕","[项目特征]\n1.土石类别:不区分土石成分，综合考虑\n2.判断标准:人工开挖槽凡图示槽底宽（不含加宽工作面）在5m以内，且槽底长大于底宽三倍以上者，执行本清单项；机械开挖槽凡图示槽底宽（不含加宽工作面）在7m以内，且槽底长大于底宽三倍以上者，执行本清单项；除上述规定外执行平基项目。\n3.开挖深度:根据原始地形图、平基施工图、地质勘察报告、基础设计施工图等综合考虑\n4.开挖方式:机械开挖，人工捡底\n6.弃渣运距:综合考虑\n[工程内容]\n1.土方开挖（调型）\n2.土石方开挖\n3.处理渗水、积水\n4.清理\n5.场内运输\n6.安全防护、警卫\n7.平整、夯实；修整底、边",{"$f":"VLOOKUP(B10,#REF!,2,FALSE)","v":{"$error":"#REF!"}},{"$f":"SUMIF(#REF!,B10,#REF!)","v":{"$error":"#REF!"}},{"$f":"VLOOKUP(B10,#REF!,6,FALSE)","v":{"$error":"#REF!"}},{"$error":"#REF!"},{"$error":"#REF!"},{"$error":"#REF!"}]
[4,"土方开挖（调型）","[项目特征]\n1.土石类别:不区分土石成分，综合考虑\n2.判断标准:人工开挖槽凡图示槽底宽（不含加宽工作面）在5m以内，且槽底长大于底宽三倍以上者，执行本清单项；机械开挖槽凡图示槽底宽（不含加宽工作面）在7m以内，且槽底长大于底宽三倍以上者，执行本清单项；除上述规定外执行平基项目。\n3.开挖深度:根据原始地形图、平基施工图、地质勘察报告、基础设计施工图等综合考虑\n4.开挖方式:机械开挖，人工捡底\n6.弃渣运距:综合考虑\n[工程内容]\n1.土方开挖（调型）\n2.土石方开挖\n3.处理渗水、积水\n4.清理\n5.场内运输\n6.安全防护、警卫\n7.平整、夯实；修整底、边",{"$f":"VLOOKUP(B11,#REF!,2,FALSE)","v":{"$error":"#REF!"}},{"$f":"SUMIF(#REF!,B11,#REF!)","v":{"$error":"#REF!"}},{"$f":"VLOOKUP(B11,#REF!,6,FALSE)","v":{"$error":"#REF!"}},{"$f":"ROUND(E11*F11,2)","v":{"$error":"#REF!"}},{"$f":"ROUND(F11*1.03,2)","v":{"$error":"#REF!"}},{"$f":"ROUND(E11*H11,2)","v":{"$error":"#REF!"}}]
[5,"土方回填（调型）","[项目特征]\n1.土石类别:不区分土石成分，综合考虑\n2.判断标准:人工开挖槽凡图示槽底宽（不含加宽工作面）在5m以内，且槽底长大于底宽三倍以上者，执行本清单项；机械开挖槽凡图示槽底宽（不含加宽工作面）在7m以内，且槽底长大于底宽三倍以上者，执行本清单项；除上述规定外执行平基项目。\n3.开挖深度:根据原始地形图、平基施工图、地质勘察报告、基础设计施工图等综合考虑\n4.开挖方式:机械开挖，人工捡底\n6.弃渣运距:综合考虑\n[工程内容]\n1.土方回填（调型）\n2.土石方回填\n3.处理渗水、积水\n4.清理\n5.场内运输\n6.安全防护、警卫\n7.平整、夯实；修整底、边",{"$f":"VLOOKUP(B12,#REF!,2,FALSE)","v":{"$error":"#REF!"}},{"$f":"SUMIF(#REF!,B12,#REF!)","v":{"$error":"#REF!"}},{"$f":"VLOOKUP(B12,#REF!,6,FALSE)","v":{"$error":"#REF!"}},{"$error":"#REF!"},{"$error":"#REF!"},{"$error":"#REF!"}]
[6,"土方开挖（格田调型）","[项目特征]\n1.土石类别:不区分土石成分，综合考虑\n2.判断标准:人工开挖槽凡图示槽底宽（不含加宽工作面）在5m以内，且槽底长大于底宽三倍以上者，执行本清单项；机械开挖槽凡图示槽底宽（不含加宽工作面）在7m以内，且槽底长大于底宽三倍以上者，执行本清单项；除上述规定外执行平基项目。\n3.开挖深度:根据原始地形图、平基施工图、地质勘察报告、基础设计施工图等综合考虑\n4.开挖方式:机械开挖，人工捡底\n6.弃渣运距:综合考虑\n[工程内容]\n1.土方开挖（格田调型）\n2.土石方开挖\n3.处理渗水、积水\n4.清理\n5.场内运输\n6.安全防护、警卫\n7.平整、夯实；修整底、边",{"$f":"VLOOKUP(B13,#REF!,2,FALSE)","v":{"$error":"#REF!"}},{"$f":"SUMIF(#REF!,B13,#REF!)","v":{"$error":"#REF!"}},{"$f":"VLOOKUP(B13,#REF!,6,FALSE)","v":{"$error":"#REF!"}},{"$error":"#REF!"},{"$error":"#REF!"},{"$error":"#REF!"}]
[7,"土方回填（格田调型）","[项目特征]\n1.土石类别:不区分土石成分，综合考虑\n2.判断标准:人工开挖槽凡图示槽底宽（不含加宽工作面）在5m以内，且槽底长大于底宽三倍以上者，执行本清单项；机械开挖槽凡图示槽底宽（不含加宽工作面）在7m以内，且槽底长大于底宽三倍以上者，执行本清单项；除上述规定外执行平基项目。\n3.开挖深度:根据原始地形图、平基施工图、地质勘察报告、基础设计施工图等综合考虑\n4.开挖方式:机械开挖，人工捡底\n6.弃渣运距:综合考虑\n[工程内容]\n1.土方回填（格田调型）\n2.土石方回填\n3.处理渗水、积水\n4.清理\n5.场内运输\n6.安全防护、警卫\n7.平整、夯实；修整底、边",{"$f":"VLOOKUP(B14,#REF!,2,FALSE)","v":{"$error":"#REF!"}},{"$f":"SUMIF(#REF!,B14,#REF!)","v":{"$error":"#REF!"}},{"$f":"VLOOKUP(B14,#REF!,6,FALSE)","v":{"$error":"#REF!"}},{"$error":"#REF!"},{"$error":"#REF!"},{"$error":"#REF!"}]
[8,"背沟清理","[项目特征]\n1.土石类别:不区分土石成分，综合考虑\n2.判断标准:人工开挖槽凡图示槽底宽（不含加宽工作面）在5m以内，且槽底长大于底宽三倍以上者，执行本清单项；机械开挖槽凡图示槽底宽（不含加宽工作面）在7m以内，且槽底长大于底宽三倍以上者，执行本清单项；除上述规定外执行平基项目。\n3.开挖深度:根据原始地形图、平基施工图、地质勘察报告、基础设计施工图等综合考虑\n4.开挖方式:机械开挖，人工捡底\n6.弃渣运距:综合考虑\n[工程内容]\n1.土方回填（格田调型）\n2.土石方回填\n3.处理渗水、积水\n4.清理\n5.场内运输\n6.安全防护、警卫\n7.平整、夯实；修整底、边",{"$f":"VLOOKUP(B15,#REF!,2,FALSE)","v":{"$error":"#REF!"}},{"$f":"SUMIF(#REF!,B15,#REF!)","v":{"$error":"#REF!"}},{"$f":"VLOOKUP(B15,#REF!,6,FALSE)","v":{"$error":"#REF!"}},{"$error":"#REF!"},{"$error":"#REF!"},{"$error":"#REF!"}]
[8,"土埂修筑","[项目特征]\n1.土石类别:不区分土石成分，综合考虑\n2.判断标准:人工开挖槽凡图示槽底宽（不含加宽工作面）在5m以内，且槽底长大于底宽三倍以上者，执行本清单项；机械开挖槽凡图示槽底宽（不含加宽工作面）在7m以内，且槽底长大于底宽三倍以上者，执行本清单项；除上述规定外执行平基项目。\n3.开挖深度:根据原始地形图、平基施工图、地质勘察报告、基础设计施工图等综合考虑\n4.开挖方式:机械开挖，人工捡底\n6.弃渣运距:综合考虑\n[工程内容]\n1.土方回填（格田调型）\n2.土石方回填\n3.处理渗水、积水\n4.清理\n5.场内运输\n6.安全防护、警卫\n7.平整、夯实；修整底、边",{"$f":"VLOOKUP(B16,#REF!,2,FALSE)","v":{"$error":"#REF!"}},{"$f":"SUMIF(#REF!,B16,#REF!)","v":{"$error":"#REF!"}},{"$f":"VLOOKUP(B16,#REF!,6,FALSE)","v":{"$error":"#REF!"}},{"$error":"#REF!"},{"$error":"#REF!"},{"$error":"#REF!"}]
[8,"筑田埂","[项目特征]\n1.土石类别:不区分土石成分，综合考虑\n2.判断标准:人工开挖槽凡图示槽底宽（不含加宽工作面）在5m以内，且槽底长大于底宽三倍以上者，执行本清单项；机械开挖槽凡图示槽底宽（不含加宽工作面）在7m以内，且槽底长大于底宽三倍以上者，执行本清单项；除上述规定外执行平基项目。\n3.开挖深度:根据原始地形图、平基施工图、地质勘察报告、基础设计施工图等综合考虑\n4.开挖方式:机械开挖，人工捡底\n6.弃渣运距:综合考虑\n[工程内容]\n1.土方回填（格田调型）\n2.土石方回填\n3.处理渗水、积水\n4.清理\n5.场内运输\n6.安全防护、警卫\n7.平整、夯实；修整底、边",{"$f":"VLOOKUP(B17,#REF!,2,FALSE)","v":{"$error":"#REF!"}},{"$f":"SUMIF(#REF!,B17,#REF!)","v":{"$error":"#REF!"}},{"$f":"VLOOKUP(B17,#REF!,6,FALSE)","v":{"$error":"#REF!"}},{"$error":"#REF!"},{"$error":"#REF!"},{"$error":"#REF!"}]
[9,"拆除田坎","1、拆除、装车、人工配合转用",{"$f":"VLOOKUP(B18,#REF!,2,FALSE)","v":{"$error":"#REF!"}},{"$f":"SUMIF(#REF!,B18,#REF!)","v":{"$error":"#REF!"}},{"$f":"VLOOKUP(B18,#REF!,6,FALSE)","v":{"$error":"#REF!"}},{"$error":"#REF!"},{"$error":"#REF!"},{"$error":"#REF!"}]
[10,"M10砂浆抹面","1.现场清理\n2.基层清扫、洗刷、配、拌、运砂浆、抹平、养护\n3.清理现场",{"$f":"VLOOKUP(B19,#REF!,2,FALSE)","v":{"$error":"#REF!"}},{"$f":"SUMIF(#REF!,B19,#REF!)","v":{"$error":"#REF!"}},{"$f":"VLOOKUP(B19,#REF!,6,FALSE)","v":{"$error":"#REF!"}},{"$error":"#REF!"},{"$error":"#REF!"},{"$error":"#REF!"}]
[11,"土方回填","[项目特征]\n1.土石类别:不区分土石成分，综合考虑\n2.判断标准:人工开挖槽凡图示槽底宽（不含加宽工作面）在5m以内，且槽底长大于底宽三倍以上者，执行本清单项；机械开挖槽凡图示槽底宽（不含加宽工作面）在7m以内，且槽底长大于底宽三倍以上者，执行本清单项；除上述规定外执行平基项目。\n3.开挖深度:根据原始地形图、平基施工图、地质勘察报告、基础设计施工图等综合考虑\n4.开挖方式:机械开挖，人工捡底\n6.弃渣运距:综合考虑\n[工程内容]\n1.土方回填（土方回填）\n2.土石方回填\n3.处理渗水、积水\n4.清理\n5.场内运输\n6.安全防护、警卫\n7.平整、夯实；修整底、边",{"$f":"VLOOKUP(B20,#REF!,2,FALSE)","v":{"$error":"#REF!"}},{"$f":"SUMIF(#REF!,B20,#REF!)","v":{"$error":"#REF!"}},{"$f":"VLOOKUP(B20,#REF!,6,FALSE)","v":{"$error":"#REF!"}},{"$f":"ROUND(E20*F20,2)","v":{"$error":"#REF!"}},{"$f":"ROUND(F20*1.03,2)","v":{"$error":"#REF!"}},{"$f":"ROUND(E20*H20,2)","v":{"$error":"#REF!"}}]
[12,"土方开挖","[项目特征]\n1.土石类别:不区分土石成分，综合考虑\n2.判断标准:人工开挖槽凡图示槽底宽（不含加宽工作面）在5m以内，且槽底长大于底宽三倍以上者，执行本清单项；机械开挖槽凡图示槽底宽（不含加宽工作面）在7m以内，且槽底长大于底宽三倍以上者，执行本清单项；除上述规定外执行平基项目。\n3.开挖深度:根据原始地形图、平基施工图、地质勘察报告、基础设计施工图等综合考虑\n4.开挖方式:机械开挖，人工捡底\n6.弃渣运距:综合考虑\n[工程内容]\n1.土方开挖（土方开挖）\n2.土石方开挖\n3.处理渗水、积水\n4.清理\n5.场内运输\n6.安全防护、警卫\n7.平整、夯实；修整底、边",{"$f":"VLOOKUP(B21,#REF!,2,FALSE)","v":{"$error":"#REF!"}},{"$f":"SUMIF(#REF!,B21,#REF!)","v":{"$error":"#REF!"}},{"$f":"VLOOKUP(B21,#REF!,6,FALSE)","v":{"$error":"#REF!"}},{"$error":"#REF!"},{"$error":"#REF!"},{"$error":"#REF!"}]
[13,"路床碾压","1.机械整平土方，人工找平修补\n2.测量放样\n3.机械碾压，人工找平\n4.回填料含水率检测等相关检测\n5.现场安全防护及管理",{"$f":"VLOOKUP(B22,#REF!,2,FALSE)","v":{"$error":"#REF!"}},{"$f":"SUMIF(#REF!,B22,#REF!)","v":{"$error":"#REF!"}},{"$f":"VLOOKUP(B22,#REF!,6,FALSE)","v":{"$error":"#REF!"}},{"$error":"#REF!"},{"$error":"#REF!"},{"$error":"#REF!"}]
[14,"15cm厚泥结石路面","1、测量放样、粗调纵坡、布置料堆、摊铺碎石、稳压、撒铺粘土、碾压\n2、二转、养护、成品保护",{"$f":"VLOOKUP(B23,#REF!,2,FALSE)","v":{"$error":"#REF!"}},{"$f":"SUMIF(#REF!,B23,#REF!)","v":{"$error":"#REF!"}},{"$f":"VLOOKUP(B23,#REF!,6,FALSE)","v":{"$error":"#REF!"}},{"$error":"#REF!"},{"$error":"#REF!"},{"$error":"#REF!"}]
[15,"沟槽土方开挖","[项目特征]\n1.土石类别:不区分土石成分，综合考虑\n2.判断标准:人工开挖槽凡图示槽底宽（不含加宽工作面）在5m以内，且槽底长大于底宽三倍以上者，执行本清单项；机械开挖槽凡图示槽底宽（不含加宽工作面）在7m以内，且槽底长大于底宽三倍以上者，执行本清单项；除上述规定外执行平基项目。\n3.开挖深度:根据原始地形图、平基施工图、地质勘察报告、基础设计施工图等综合考虑\n4.开挖方式:机械开挖，人工捡底\n6.弃渣运距:综合考虑\n[工程内容]\n1.挖沟槽土石方\n2.沟槽内土石方回填\n3.处理渗水、积水\n4.清理\n5.场内运输\n6.安全防护、警卫\n7.围护、支撑\n8.平整、夯实；修整底、边",{"$f":"VLOOKUP(B24,#REF!,2,FALSE)","v":{"$error":"#REF!"}},{"$f":"SUMIF(#REF!,B24,#REF!)","v":{"$error":"#REF!"}},{"$f":"VLOOKUP(B24,#REF!,6,FALSE)","v":{"$error":"#REF!"}},{"$error":"#REF!"},{"$error":"#REF!"},{"$error":"#REF!"}]
[16,"PVC-U排水管","1、材料搬运；\n2、材料准备：将管道或管件置于平坦位置，放于对接机上，留足10-20mm的切削余量。\n3、夹紧：根据所焊制的管材、管件选择合适的卡瓦夹具，夹紧管材，为切削做好准备。\n4、切削：切削所焊管段、管件端面杂质和氧化层，保证两对接端面平整、光洁、无杂质。\n5、对中：两焊管段端面要完全对中，错边越小越好，错边不能超过壁厚的10%。否则，将影响对接质量。\n6、加热：对接温度一般在210-230℃之间为宜，加热板加热时间冬夏有别，以两端面熔融长度为1-2mm为佳。\n7、切换：将加热板拿开，迅速让两热融端面相粘并加压，为保证熔融对接质量，切换周期越短越好。\n8、熔融对接：是焊接的关键，对接过程应始终处于熔融压力下进行，卷边宽度以2-4mm为宜。\n9、冷却：保持对接压力不变，让接口缓慢冷却，冷却时间长短以手摸卷边生硬，感觉不到热为准。\n10、对接完成：冷却好后松开卡瓦，移开对接机，重新准备下一接口连接。",{"$f":"VLOOKUP(B25,#REF!,2,FALSE)","v":{"$error":"#REF!"}},{"$f":"SUMIF(#REF!,B25,#REF!)","v":{"$error":"#REF!"}},{"$f":"VLOOKUP(B25,#REF!,6,FALSE)","v":{"$error":"#REF!"}},{"$error":"#REF!"},{"$error":"#REF!"},{"$error":"#REF!"}]
[16,"φ32PE管（1.0MPa）","1、材料搬运；\n2、材料准备：将管道或管件置于平坦位置，放于对接机上，留足10-20mm的切削余量。\n3、夹紧：根据所焊制的管材、管件选择合适的卡瓦夹具，夹紧管材，为切削做好准备。\n4、切削：切削所焊管段、管件端面杂质和氧化层，保证两对接端面平整、光洁、无杂质。\n5、对中：两焊管段端面要完全对中，错边越小越好，错边不能超过壁厚的10%。否则，将影响对接质量。\n6、加热：对接温度一般在210-230℃之间为宜，加热板加热时间冬夏有别，以两端面熔融长度为1-2mm为佳。\n7、切换：将加热板拿开，迅速让两热融端面相粘并加压，为保证熔融对接质量，切换周期越短越好。\n8、熔融对接：是焊接的关键，对接过程应始终处于熔融压力下进行，卷边宽度以2-4mm为宜。\n9、冷却：保持对接压力不变，让接口缓慢冷却，冷却时间长短以手摸卷边生硬，感觉不到热为准。\n10、对接完成：冷却好后松开卡瓦，移开对接机，重新准备下一接口连接。",{"$f":"VLOOKUP(B26,#REF!,2,FALSE)","v":{"$error":"#REF!"}},{"$f":"SUMIF(#REF!,B26,#REF!)","v":{"$error":"#REF!"}},{"$f":"VLOOKUP(B26,#REF!,6,FALSE)","v":{"$error":"#REF!"}},{"$error":"#REF!"},{"$error":"#REF!"},{"$error":"#REF!"}]
[17,"DN75（1.0MPa）PE100管道安装","1、材料搬运；\n2、材料准备：将管道或管件置于平坦位置，放于对接机上，留足10-20mm的切削余量。\n3、夹紧：根据所焊制的管材、管件选择合适的卡瓦夹具，夹紧管材，为切削做好准备。\n4、切削：切削所焊管段、管件端面杂质和氧化层，保证两对接端面平整、光洁、无杂质。\n5、对中：两焊管段端面要完全对中，错边越小越好，错边不能超过壁厚的10%。否则，将影响对接质量。\n6、加热：对接温度一般在210-230℃之间为宜，加热板加热时间冬夏有别，以两端面熔融长度为1-2mm为佳。\n7、切换：将加热板拿开，迅速让两热融端面相粘并加压，为保证熔融对接质量，切换周期越短越好。\n8、熔融对接：是焊接的关键，对接过程应始终处于熔融压力下进行，卷边宽度以2-4mm为宜。\n9、冷却：保持对接压力不变，让接口缓慢冷却，冷却时间长短以手摸卷边生硬，感觉不到热为准。\n10、对接完成：冷却好后松开卡瓦，移开对接机，重新准备下一接口连接。",{"$f":"VLOOKUP(B27,#REF!,2,FALSE)","v":{"$error":"#REF!"}},{"$f":"SUMIF(#REF!,B27,#REF!)","v":{"$error":"#REF!"}},{"$f":"VLOOKUP(B27,#REF!,6,FALSE)","v":{"$error":"#REF!"}},{"$error":"#REF!"},{"$error":"#REF!"},{"$error":"#REF!"}]
[18,"DN90（1.0MPa）PE100管道安装","1、材料搬运；\n2、材料准备：将管道或管件置于平坦位置，放于对接机上，留足10-20mm的切削余量。\n3、夹紧：根据所焊制的管材、管件选择合适的卡瓦夹具，夹紧管材，为切削做好准备。\n4、切削：切削所焊管段、管件端面杂质和氧化层，保证两对接端面平整、光洁、无杂质。\n5、对中：两焊管段端面要完全对中，错边越小越好，错边不能超过壁厚的10%。否则，将影响对接质量。\n6、加热：对接温度一般在210-230℃之间为宜，加热板加热时间冬夏有别，以两端面熔融长度为1-2mm为佳。\n7、切换：将加热板拿开，迅速让两热融端面相粘并加压，为保证熔融对接质量，切换周期越短越好。\n8、熔融对接：是焊接的关键，对接过程应始终处于熔融压力下进行，卷边宽度以2-4mm为宜。\n9、冷却：保持对接压力不变，让接口缓慢冷却，冷却时间长短以手摸卷边生硬，感觉不到热为准。\n10、对接完成：冷却好后松开卡瓦，移开对接机，重新准备下一接口连接。",{"$f":"VLOOKUP(B28,#REF!,2,FALSE)","v":{"$error":"#REF!"}},{"$f":"SUMIF(#REF!,B28,#REF!)","v":{"$error":"#REF!"}},{"$f":"VLOOKUP(B28,#REF!,6,FALSE)","v":{"$error":"#REF!"}},{"$error":"#REF!"},{"$error":"#REF!"},{"$error":"#REF!"}]
[19,"DN200（1.0MPa）PE100管道安装","1、材料搬运；\n2、材料准备：将管道或管件置于平坦位置，放于对接机上，留足10-20mm的切削余量。\n3、夹紧：根据所焊制的管材、管件选择合适的卡瓦夹具，夹紧管材，为切削做好准备。\n4、切削：切削所焊管段、管件端面杂质和氧化层，保证两对接端面平整、光洁、无杂质。\n5、对中：两焊管段端面要完全对中，错边越小越好，错边不能超过壁厚的10%。否则，将影响对接质量。\n6、加热：对接温度一般在210-230℃之间为宜，加热板加热时间冬夏有别，以两端面熔融长度为1-2mm为佳。\n7、切换：将加热板拿开，迅速让两热融端面相粘并加压，为保证熔融对接质量，切换周期越短越好。\n8、熔融对接：是焊接的关键，对接过程应始终处于熔融压力下进行，卷边宽度以2-4mm为宜。\n9、冷却：保持对接压力不变，让接口缓慢冷却，冷却时间长短以手摸卷边生硬，感觉不到热为准。\n10、对接完成：冷却好后松开卡瓦，移开对接机，重新准备下一接口连接。",{"$f":"VLOOKUP(B29,#REF!,2,FALSE)","v":{"$error":"#REF!"}},{"$f":"SUMIF(#REF!,B29,#REF!)","v":{"$error":"#REF!"}},{"$f":"VLOOKUP(B29,#REF!,6,FALSE)","v":{"$error":"#REF!"}},{"$error":"#REF!"},{"$error":"#REF!"},{"$error":"#REF!"}]
[20,"模板","1.模板制作、安装、拆除、平面定位、高程控制\n2.涂刷隔离剂、支撑、拆模、清洗、回收",{"$f":"VLOOKUP(B30,#REF!,2,FALSE)","v":{"$error":"#REF!"}},{"$f":"SUMIF(#REF!,B30,#REF!)","v":{"$error":"#REF!"}},{"$f":"VLOOKUP(B30,#REF!,6,FALSE)","v":{"$error":"#REF!"}},{"$error":"#REF!"},{"$error":"#REF!"},{"$error":"#REF!"}]
[21,"M7.5浆砌砖","1、M7.5砌筑工作；\n2、材料搬运、拌、运砂浆；\n3、搭、拆脚手架；\n4、砌筑、勾缝、养护；\n5、沉降缝胶泥制作与填抹；\n6、排水孔下的胶泥铺设与孔口填石；\n7、安全措施。",{"$f":"VLOOKUP(B31,#REF!,2,FALSE)","v":{"$error":"#REF!"}},{"$f":"SUMIF(#REF!,B31,#REF!)","v":{"$error":"#REF!"}},{"$f":"VLOOKUP(B31,#REF!,6,FALSE)","v":{"$error":"#REF!"}},{"$error":"#REF!"},{"$error":"#REF!"},{"$error":"#REF!"}]
[22,"土方回填夯实","[项目特征]\n1.土石类别:不区分土石成分，综合考虑\n2.判断标准:人工开挖槽凡图示槽底宽（不含加宽工作面）在5m以内，且槽底长大于底宽三倍以上者，执行本清单项；机械开挖槽凡图示槽底宽（不含加宽工作面）在7m以内，且槽底长大于底宽三倍以上者，执行本清单项；除上述规定外执行平基项目。\n3.开挖深度:根据原始地形图、平基施工图、地质勘察报告、基础设计施工图等综合考虑\n4.开挖方式:机械开挖，人工捡底\n6.弃渣运距:综合考虑\n[工程内容]\n1.土方回填（土方回填夯实）\n2.土石方回填\n3.处理渗水、积水\n4.清理\n5.场内运输\n6.安全防护、警卫\n7.平整、夯实；修整底、边",{"$f":"VLOOKUP(B32,#REF!,2,FALSE)","v":{"$error":"#REF!"}},{"$f":"SUMIF(#REF!,B32,#REF!)","v":{"$error":"#REF!"}},{"$f":"VLOOKUP(B32,#REF!,6,FALSE)","v":{"$error":"#REF!"}},{"$error":"#REF!"},{"$error":"#REF!"},{"$error":"#REF!"}]
[23,"20cm厚C20砼底板","1、模板制作、安装、拆除；\n2、混凝土运输、浇筑（砼浇注前、后的系列工作，包括砼施工的施工前准备，编制砼用量计划、清洁、修复、浇注、泵送配合、根据进度留设施工缝、施工缝处理剔打、养护、砼等垃圾处理、砼浇注质量问题处理等除砼搅拌外的砼施工的全部工序内容）；\n3、安全设施搭拆、个人安全措施、自备辅材、自备所有施工机械设备及工器具；\n4.养护；\n5.现场安全防护及管理。",{"$f":"VLOOKUP(B33,#REF!,2,FALSE)","v":{"$error":"#REF!"}},{"$f":"SUMIF(#REF!,B33,#REF!)","v":{"$error":"#REF!"}},{"$f":"VLOOKUP(B33,#REF!,6,FALSE)","v":{"$error":"#REF!"}},{"$error":"#REF!"},{"$error":"#REF!"},{"$error":"#REF!"}]
[24,"泄水管Φ50PVC","1、材料搬运；\n2、材料准备：将管道或管件置于平坦位置，放于对接机上，留足10-20mm的切削余量。\n3、夹紧：根据所焊制的管材、管件选择合适的卡瓦夹具，夹紧管材，为切削做好准备。\n4、切削：切削所焊管段、管件端面杂质和氧化层，保证两对接端面平整、光洁、无杂质。\n5、对中：两焊管段端面要完全对中，错边越小越好，错边不能超过壁厚的10%。否则，将影响对接质量。\n6、加热：对接温度一般在210-230℃之间为宜，加热板加热时间冬夏有别，以两端面熔融长度为1-2mm为佳。\n7、切换：将加热板拿开，迅速让两热融端面相粘并加压，为保证熔融对接质量，切换周期越短越好。\n8、熔融对接：是焊接的关键，对接过程应始终处于熔融压力下进行，卷边宽度以2-4mm为宜。\n9、冷却：保持对接压力不变，让接口缓慢冷却，冷却时间长短以手摸卷边生硬，感觉不到热为准。\n10、对接完成：冷却好后松开卡瓦，移开对接机，重新准备下一接口连接。",{"$f":"VLOOKUP(B34,#REF!,2,FALSE)","v":{"$error":"#REF!"}},{"$f":"SUMIF(#REF!,B34,#REF!)","v":{"$error":"#REF!"}},{"$f":"VLOOKUP(B34,#REF!,6,FALSE)","v":{"$error":"#REF!"}},{"$error":"#REF!"},{"$error":"#REF!"},{"$error":"#REF!"}]
[25,"泥结碎石路面","1、测量放样、粗调纵坡、布置料堆、摊铺碎石、稳压、撒铺粘土、碾压\n2、二转、养护、成品保护",{"$f":"VLOOKUP(B35,#REF!,2,FALSE)","v":{"$error":"#REF!"}},{"$f":"SUMIF(#REF!,B35,#REF!)","v":{"$error":"#REF!"}},{"$f":"VLOOKUP(B35,#REF!,6,FALSE)","v":{"$error":"#REF!"}},{"$error":"#REF!"},{"$error":"#REF!"},{"$error":"#REF!"}]
[26,"预制C30钢筋砼","1、模板制作、安装、拆除、安装；\n2、混凝土运输、浇筑（砼浇注前、后的系列工作，包括砼施工的施工前准备，编制砼用量计划、清洁、修复、浇注、泵送配合、根据进度留设施工缝、施工缝处理剔打、养护、砼等垃圾处理、砼浇注质量问题处理等除砼搅拌外的砼施工的全部工序内容）；\n3、安全设施搭拆、个人安全措施、自备辅材、自备所有施工机械设备及工器具；\n4.养护；\n5.现场安全防护及管理。",{"$f":"VLOOKUP(B36,#REF!,2,FALSE)","v":{"$error":"#REF!"}},{"$f":"SUMIF(#REF!,B36,#REF!)","v":{"$error":"#REF!"}},{"$f":"VLOOKUP(B36,#REF!,6,FALSE)","v":{"$error":"#REF!"}},{"$error":"#REF!"},{"$error":"#REF!"},{"$error":"#REF!"}]
[27,"土质边沟","[项目特征]\n1.土石类别:不区分土石成分，综合考虑\n2.判断标准:人工开挖槽凡图示槽底宽（不含加宽工作面）在5m以内，且槽底长大于底宽三倍以上者，执行本清单项；机械开挖槽凡图示槽底宽（不含加宽工作面）在7m以内，且槽底长大于底宽三倍以上者，执行本清单项；除上述规定外执行平基项目。\n3.开挖深度:根据原始地形图、平基施工图、地质勘察报告、基础设计施工图等综合考虑\n4.开挖方式:机械开挖，人工捡底\n6.弃渣运距:综合考虑\n[工程内容]\n1.挖沟槽土石方\n2.沟槽内土石方回填\n3.处理渗水、积水\n4.清理\n5.场内运输\n6.安全防护、警卫\n7.围护、支撑\n8.平整、夯实；修整底、边",{"$f":"VLOOKUP(B37,#REF!,2,FALSE)","v":{"$error":"#REF!"}},{"$f":"SUMIF(#REF!,B37,#REF!)","v":{"$error":"#REF!"}},{"$f":"VLOOKUP(B37,#REF!,6,FALSE)","v":{"$error":"#REF!"}},{"$error":"#REF!"},{"$error":"#REF!"},{"$error":"#REF!"}]
[28,"背沟清理","1.土（石）方开挖及运输距离根据施工队伍综合考虑\n2.测量放样\n3.涵洞及桥梁基础开挖后的±10cm捡底\n4.路面土基层开挖后的±10cm捡底\n5.运输道路清理\n6.排地表水、土方开挖、支撑、将土置于槽、坑边1m以外5m以内自然堆放、基底钎探及开挖未达到设计要求的返工等工作内容。\n7.现场安全防护及管理\n8.临时交通指挥及安全措施",{"$f":"VLOOKUP(B38,#REF!,2,FALSE)","v":{"$error":"#REF!"}},{"$f":"SUMIF(#REF!,B38,#REF!)","v":{"$error":"#REF!"}},{"$f":"VLOOKUP(B38,#REF!,6,FALSE)","v":{"$error":"#REF!"}},{"$error":"#REF!"},{"$error":"#REF!"},{"$error":"#REF!"}]
[29,"土路肩","1、清除杂物；\n2、挖掘路肩；\n3、打夯压实；\n4、补充填料。",{"$f":"VLOOKUP(B39,#REF!,2,FALSE)","v":{"$error":"#REF!"}},{"$f":"SUMIF(#REF!,B39,#REF!)","v":{"$error":"#REF!"}},{"$f":"VLOOKUP(B39,#REF!,6,FALSE)","v":{"$error":"#REF!"}},{"$error":"#REF!"},{"$error":"#REF!"},{"$error":"#REF!"}]
[30,"BV-2x2.5绝缘电线","[项目特征]\n1.设备房机电安装，材料甲方提供\n[工程内容]\n1.开槽、安装、布线、成品保护",{"$f":"VLOOKUP(B40,#REF!,2,FALSE)","v":{"$error":"#REF!"}},{"$f":"SUMIF(#REF!,B40,#REF!)","v":{"$error":"#REF!"}},{"$f":"VLOOKUP(B40,#REF!,6,FALSE)","v":{"$error":"#REF!"}},{"$error":"#REF!"},{"$error":"#REF!"},{"$error":"#REF!"}]
{"$rows_left_out":47}
{"sheet":"机械清单表","index":2,"n_rows":18,"n_cols":16,"rows_kept":18,"hidden":true,"merged":[[2,0,2,6],[3,0,3,6],[4,0,4,6]]}
[]
[]
["2024年隆昌市财政转移支付高标准农田新建项目-石印村"]
["机械清单表  单位：元"]
["项目名称：2024年隆昌市财政转移支付高标准农田新建项目-石印村"]
["序号","项目名称","计量单位","工程数量\n（暂估）","单价\n(含税）","合价","备注"]
[1,"功率75kW以内履带式推土机（TY100）","台班",{"v":435,"d":"435.00"},{"v":2575,"d":"2575.00"},{"$f":"D7*E7","v":{"v":1120125,"d":"1120125.00"}}]
[{"$f":"A7+1","v":2},"蛙式夯实机 2.8kw","台时",{"v":798,"d":"798.00"},15.45,{"v":12329.1,"d":"12329.10"},{"$nulls":7},80,150,{"$f":"O8*8","v":1200}]
[3,"机械自身质量光轮压路机（2Y-8/10）","台班",{"v":80,"d":"80.00"},{"v":1606.8,"d":"1606.80"},{"v":128544,"d":"128544.00"},{"$nulls":7},150,200,1600]
[4,"装载质量20t以内自卸汽车（BJ374）","台班",{"v":244,"d":"244.00"},{"v":1236,"d":"1236.00"},{"v":301584,"d":"301584.00"},{"$nulls":7},200,290,2320]
[5,"提升质量16t以内汽车式起重机（QY16）","台班",{"v":60,"d":"60.00"},{"v":1854,"d":"1854.00"},{"v":111240,"d":"111240.00"}]
[6,"斗容量0.6m3履带式单斗挖掘机（WY80液压）","台班",{"v":848,"d":"848.00"},{"v":1236,"d":"1236.00"},{"v":1048128,"d":"1048128.00"}]
[7,"斗容量0.8m3履带式单斗挖掘机（WY150液压）","台班",{"v":825,"d":"825.00"},{"v":1648,"d":"1648.00"},{"v":1359600,"d":"1359600.00"}]
[8,"斗容量1.0m3履带式单斗挖掘机（WY220液压）","台班",{"v":561,"d":"561.00"},{"v":2389.6,"d":"2389.60"},{"v":1340565.6,"d":"1340565.60"}]
[9,"其它机械设备","项",{"v":1,"d":"1.00"},46143.26,46143.26]
[null,"合计",{"$nulls":3},{"$f":"SUM(F7:F15)","v":5468258.96}]
[{"$nulls":5},{"$f":"#REF!","v":{"$error":"#REF!"}}]
[{"$nulls":5},{"$f":"F17-F16","v":{"$error":"#REF!"}}]

{"sheet":"材料清单表","index":3,"n_rows":29,"n_cols":7,"rows_kept":29,"hidden":true,"merged":[[1,0,1,6],[2,0,2,6],[3,0,3,6],[26,0,26,4]]}
[]
["2024年隆昌市财政转移支付高标准农田新建项目-石印村"]
["材料清单表  单位：元"]
["项目名称：2024年隆昌市财政转移支付高标准农田新建项目-石印村"]
["序号","项目名称","计量单位","工程数量\n（预估）","含税\n单价","合价","备注"]
[1,"DN75（1.0MPa）PE100管道","m",{"v":5295,"d":"5295.00"},{"v":90.4,"d":"90.40"},{"$f":"ROUND(D6*E6,2)","v":{"v":478668,"d":"478668.00"}}]
[2,"DN160（1.0MPa）PE100管道","m",{"v":5001,"d":"5001.00"},99.44,497299.44]
[3,"DN200（1.0MPa）PE100管道","m",{"v":4548,"d":"4548.00"},129.95,{"v":591012.6,"d":"591012.60"}]
[4,"C15混凝土","m3",{"v":135,"d":"135.00"},435.05,58731.75]
[5,"C20混凝土","m3",{"v":1748,"d":"1748.00"},449.81,786267.88]
[6,"C25混凝土","m3",{"v":240,"d":"240.00"},461.04,{"v":110649.6,"d":"110649.60"}]
[7,"C30混凝土","m3",{"v":311,"d":"311.00"},472.34,146897.74]
[8,"真空泵200QJ80-88/8","台",{"v":1,"d":"1.00"},{"v":24860,"d":"24860.00"},{"v":24860,"d":"24860.00"}]
[9,"真空泵200QJ63-84/7","台",{"v":1,"d":"1.00"},{"v":15594,"d":"15594.00"},{"v":15594,"d":"15594.00"}]
[10,"钢筋混凝土管","米",{"v":556,"d":"556.00"},{"v":169.5,"d":"169.50"},{"v":94242,"d":"94242.00"}]
[11,"控制柜22KW 软启动柜","个",{"v":1,"d":"1.00"},{"v":2938,"d":"2938.00"},{"v":2938,"d":"2938.00"}]
[12,"控制柜30KW 软启动柜","个",{"v":1,"d":"1.00"},{"v":3250,"d":"3250.00"},{"v":3250,"d":"3250.00"}]
[13,"1.0MPa DN200涡轮流量计","个",{"v":2,"d":"2.00"},{"v":1921,"d":"1921.00"},{"v":3842,"d":"3842.00"}]
[14,"卵石 40mm","m3",{"v":1458,"d":"1458.00"},{"v":135.6,"d":"135.60"},{"v":197704.8,"d":"197704.80"}]
[15,"特细砂","m3",{"v":1440,"d":"1440.00"},{"v":226,"d":"226.00"},{"v":325440,"d":"325440.00"}]
[16,"砖","千匹",{"v":2958,"d":"2958.00"},{"v":418.1,"d":"418.10"},{"$f":"ROUND(D21*E21,2)","v":{"v":1236739.8,"d":"1236739.80"}}]
[17,"钢筋、综合","t",{"v":45,"d":"45.00"},4028.45,181280.25]
[18,"管线、综合","项",{"v":1,"d":"1.00"},{"v":94150,"d":"94150.00"},{"v":94150,"d":"94150.00"}]
[19,"碎石","m3",{"v":2884,"d":"2884.00"},{"v":101.7,"d":"101.70"},{"v":293302.8,"d":"293302.80"}]
[20,"水泥","t",{"v":1748,"d":"1748.00"},{"v":384.2,"d":"384.20"},{"v":671581.6,"d":"671581.60"}]
[21,"零星材料","项",{"v":1,"d":"1.00"},192185.21,192185.21]
["合计",{"$nulls":4},{"$f":"SUM(F6:F26)","v":6006637.47}]
[{"$nulls":5},{"$f":"#REF!","v":{"$error":"#REF!"}}]
[{"$nulls":5},{"$f":"F28-F27","v":{"$error":"#REF!"}}]